Reaction Details
TargetHistone deacetylase 2
LigandBDBM178097
Substrate/Competitorn/a
Meas. Tech.In-vitro HDAC Enzymatic Endpoint Assay
pH7.4±n/a
Temperature298.15±n/a K
IC50 479± 72 nM
Commentsextracted
Citation Wagner, FFLundh, MKaya, TMcCarren, PZhang, YLChattopadhyay, SGale, JPGalbo, TFisher, SLMeier, BCVetere, ARichardson, SMorgan, NGChristensen, DPGilbert, TJHooker, JMLeroy, MWalpita, DMandrup-Poulsen, TWagner, BKHolson, EB An Isochemogenic Set of Inhibitors To Define the Therapeutic Potential of Histone Deacetylases in ß-Cell Protection. ACS Chem Biol11:363-74 (2016) 
 
Histone deacetylase 2
Name:Histone deacetylase 2
Type:Chromatin regulator; hydrolase; repressor
Mol. Mass.:55356.54
Organism:Homo sapiens (Human)
Description:Q92769
Residue:488
BDBM178097
NameBDBM178097
Synonyms:4-Acetamido-N-(2-amino-5-fluorophenyl)benzamide (7) | US11377423, Compound 11
TypeSmall organic molecule
Emp. Form.C15H14FN3O2
Mol. Mass.287.289
SMILESCC(=O)Nc1ccc(cc1)C(=O)Nc1cc(F)ccc1N