Reaction Details
TargetProtein arginine N-methyltransferase 1 [11-371]
LigandBDBM178102
Substrate/Competitorn/a
Meas. Tech.PRMT Biochemical Assays
Ki 120±4 nM
IC50 250±15 nM
Citation Eram, MSShen, YSzewczyk, MMWu, HSenisterra, GLi, FButler, KVKaniskan, HÿSpeed, BADela Seña, CDong, AZeng, HSchapira, MBrown, PJArrowsmith, CHBarsyte-Lovejoy, DLiu, JVedadi, MJin, J A Potent, Selective, and Cell-Active Inhibitor of Human Type I Protein Arginine Methyltransferases. ACS Chem Biol11:772-81 (2016) 
 
Protein arginine N-methyltransferase 1 [11-371]
Name:Protein arginine N-methyltransferase 1 [11-371]
Type:Protein
Mol. Mass.:41506.52
Organism:Homo sapiens (Human)
Description:Q99873[11-371]
Residue:361
BDBM178102
NameBDBM178102
Synonyms:N1-Methyl-N1-((4-(3-(trifluoromethyl)phenyl)-1H-pyrrol-3-yl)methyl)ethane-1,2-diamine (Compound 2)
TypeSmall organic molecule
Emp. Form.C15H18F3N3
Mol. Mass.297.3187
SMILESCN(CCN)Cc1c[nH]cc1-c1cccc(c1)C(F)(F)F