Reaction Details
TargetHistone-arginine methyltransferase CARM1
LigandBDBM178102
Substrate/Competitorn/a
Meas. Tech.PRMT Biochemical Assays
Ki 120±5 nM
IC50 260±10 nM
Citation Eram, MSShen, YSzewczyk, MMWu, HSenisterra, GLi, FButler, KVKaniskan, HÿSpeed, BADela Seña, CDong, AZeng, HSchapira, MBrown, PJArrowsmith, CHBarsyte-Lovejoy, DLiu, JVedadi, MJin, J A Potent, Selective, and Cell-Active Inhibitor of Human Type I Protein Arginine Methyltransferases. ACS Chem Biol11:772-81 (2016) 
 
Histone-arginine methyltransferase CARM1
Name:Histone-arginine methyltransferase CARM1
Type:Protein
Mol. Mass.:65855.47
Organism:Homo sapiens (Human)
Description:Q86X55
Residue:608
BDBM178102
NameBDBM178102
Synonyms:N1-Methyl-N1-((4-(3-(trifluoromethyl)phenyl)-1H-pyrrol-3-yl)methyl)ethane-1,2-diamine (Compound 2)
TypeSmall organic molecule
Emp. Form.C15H18F3N3
Mol. Mass.297.3187
SMILESCN(CCN)Cc1c[nH]cc1-c1cccc(c1)C(F)(F)F