Reaction Details
TargetBeta-lactamase SHV-1
LigandBDBM50053173
Substrate/Competitorn/a
Meas. Tech.Cell Free Inhibition Assay
pH7±n/a
Temperature310.15±n/a K
IC50 222±n/a nM
Commentsextracted
Citation Bulusu, AR Substituted clavulanic acid US Patent US9120808 Publication Date 9/1/2015
 
Beta-lactamase SHV-1
Name:Beta-lactamase SHV-1
Type:Enzyme
Mol. Mass.:31226.68
Organism:Escherichia coli
Description:P0AD63
Residue:286
BDBM50053173
NameBDBM50053173
Synonyms:(2S,3S,5R)-3-Methyl-4,4,7-trioxo-3-[1,2,3]triazol-1-ylmethyl-4-thia-1-aza-bicyclo[3.2.0]heptane-2-carboxylic acid (2S,3S,5R)-3-methyl-4,4,7-trioxo-3-[1,2,3]triazol-1-ylmethyl-4lambda6-thia-1-aza-bicyclo[3.2.0]heptane-2-carboxylic acid 3-Methyl-4,4,7-trioxo-3-[1,2,3]triazol-1-ylmethyl-4lambda*6*-thia-1-aza-bicyclo[3.2.0]heptane-2-carboxylic acid CL-298741 US9120808, Tazobactam sodium salt YTR-830H | Zosyn
TypeSmall organic molecule
Emp. Form.C10H12N4O5S
Mol. Mass.300.291
SMILESC[C@]1(Cn2ccnn2)[C@@H](N2[C@@H](CC2=O)S1(=O)=O)C(O)=O