Reaction Details
TargetBeta-lactamase SHV-1
LigandBDBM178153
Substrate/Competitorn/a
Meas. Tech.Cell Free Inhibition Assay
pH7±n/a
Temperature310.15±n/a K
IC50 2307.2±n/a nM
Commentsextracted
Citation Bulusu, AR Substituted clavulanic acid US Patent US9120808 Publication Date 9/1/2015
 
Beta-lactamase SHV-1
Name:Beta-lactamase SHV-1
Type:Enzyme
Mol. Mass.:31226.68
Organism:Escherichia coli
Description:P0AD63
Residue:286
BDBM178153
NameBDBM178153
Synonyms:US9120808, Example 35 | US9120808, Example 36
TypeSmall organic molecule
Emp. Form.C18H17NO6
Mol. Mass.343.3307
SMILESCOC(=O)C1(C\C=C\c2ccccc2)N2[C@@H](CC2=O)OC1=CC(O)=O