Reaction Details
TargetBeta-lactamase SHV-1
LigandBDBM178169
Substrate/Competitorn/a
Meas. Tech.Cell Free Inhibition Assay
pH7±n/a
Temperature310.15±n/a K
IC50 4.2±n/a nM
Commentsextracted
Citation Bulusu, AR Substituted clavulanic acid US Patent US9120808 Publication Date 9/1/2015
 
Beta-lactamase SHV-1
Name:Beta-lactamase SHV-1
Type:Enzyme
Mol. Mass.:31226.68
Organism:Escherichia coli
Description:P0AD63
Residue:286
BDBM178169
NameBDBM178169
Synonyms:US9120808, Example 48
TypeSmall organic molecule
Emp. Form.C18H16N4O6
Mol. Mass.384.3428
SMILES[N-]=[N+]=NCC1C\C(C(=O)O1)=C1/O[C@@H]2CC(=O)N2C1C(=O)OCc1ccccc1