Reaction Details
TargetBeta-lactamase SHV-1
LigandBDBM178210
Substrate/Competitorn/a
Meas. Tech.Cell Free Inhibition Assay
pH7±n/a
Temperature310.15±n/a K
IC50 219±n/a nM
Commentsextracted
Citation Bulusu, AR Substituted clavulanic acid US Patent US9120808 Publication Date 9/1/2015
 
Beta-lactamase SHV-1
Name:Beta-lactamase SHV-1
Type:Enzyme
Mol. Mass.:31226.68
Organism:Escherichia coli
Description:P0AD63
Residue:286
BDBM178210
NameBDBM178210
Synonyms:US9120808, Example 53
TypeSmall organic molecule
Emp. Form.C18H19NO6
Mol. Mass.345.3466
SMILESCOC(=O)C1N2[C@@H](CC2=O)OC1=C(CCCc1ccccc1)C(O)=O