Reaction Details
TargetApoptosis regulator Bcl-2
LigandBDBM178639
Substrate/Competitorn/a
Meas. Tech.Time Resolved-Fluorescence Resonance Energy Transfer (TR-FRET) Assay
Ki 0.005±n/a nM
Citation Bruncko, MDing, HDoherty, GAElmore, SWHasvold, LHexamer, LAKunzer, ARMantei, RAMcClellan, WJPark, CHPark, CPetros, AMSong, XSouers, AJSullivan, GMTao, ZWang, GTWang, LWang, XWendt, MD Bcl-2-selective apoptosis-inducing agents for the treatment of cancer and immune diseases US Patent US9125913 Publication Date 9/8/2015
 
Apoptosis regulator Bcl-2
Name:Apoptosis regulator Bcl-2
Type:Protein
Mol. Mass.:26409.44
Organism:Mus musculus (Mouse)
Description:P10417
Residue:236
BDBM178639
NameBDBM178639
Synonyms:US9125913, 205
TypeSmall organic molecule
Emp. Form.C48H53ClN8O7S
Mol. Mass.921.502
SMILESCN(C)CCOc1cccc(c1CN1CCN(CC1)c1ccc(C(=O)NS(=O)(=O)c2ccc(NC3CCN(C)CC3)c(c2)[N+]([O-])=O)c(Oc2cccc3[nH]ccc23)c1)-c1ccc(Cl)cc1