Reaction Details
TargetApoptosis regulator Bcl-2
LigandBDBM178842
Substrate/Competitorn/a
Meas. Tech.Time Resolved-Fluorescence Resonance Energy Transfer (TR-FRET) Assay
Ki 0.007±n/a nM
Citation Bruncko, MDing, HDoherty, GAElmore, SWHasvold, LHexamer, LAKunzer, ARMantei, RAMcClellan, WJPark, CHPark, CPetros, AMSong, XSouers, AJSullivan, GMTao, ZWang, GTWang, LWang, XWendt, MD Bcl-2-selective apoptosis-inducing agents for the treatment of cancer and immune diseases US Patent US9125913 Publication Date 9/8/2015
 
Apoptosis regulator Bcl-2
Name:Apoptosis regulator Bcl-2
Type:Protein
Mol. Mass.:26409.44
Organism:Mus musculus (Mouse)
Description:P10417
Residue:236
BDBM178842
NameBDBM178842
Synonyms:US9125913, 414
TypeSmall organic molecule
Emp. Form.C46H52Cl2N6O6S
Mol. Mass.887.913
SMILESCOC1CCC(COc2ncc(cc2Cl)S(=O)(=O)NC(=O)c2ccc(cc2Oc2cccc3[nH]ncc23)N2CCN(CC3=C(CC(C)(C)CC3)c3ccc(Cl)cc3)CC2)CC1