Reaction Details
TargetApoptosis regulator Bcl-2
LigandBDBM178858
Substrate/Competitorn/a
Meas. Tech.Time Resolved-Fluorescence Resonance Energy Transfer (TR-FRET) Assay
Ki<0.010±n/a nM
Citation Bruncko, MDing, HDoherty, GAElmore, SWHasvold, LHexamer, LAKunzer, ARMantei, RAMcClellan, WJPark, CHPark, CPetros, AMSong, XSouers, AJSullivan, GMTao, ZWang, GTWang, LWang, XWendt, MD Bcl-2-selective apoptosis-inducing agents for the treatment of cancer and immune diseases US Patent US9125913 Publication Date 9/8/2015
 
Apoptosis regulator Bcl-2
Name:Apoptosis regulator Bcl-2
Type:Protein
Mol. Mass.:26409.44
Organism:Mus musculus (Mouse)
Description:P10417
Residue:236
BDBM178858
NameBDBM178858
Synonyms:US9125913, 430
TypeSmall organic molecule
Emp. Form.C47H54ClN9O7S
Mol. Mass.924.506
SMILESCN(C)CC(=O)N1CC[C@H](C1)Nc1ccc(cc1[N+]([O-])=O)S(=O)(=O)NC(=O)c1ccc(cc1Oc1cccc2[nH]cnc12)N1CCN(CC2=C(CC(C)(C)CC2)c2ccc(Cl)cc2)CC1