Reaction Details
TargetBcl-2-like protein 1
LigandBDBM178839
Substrate/Competitorn/a
Meas. Tech.Time Resolved-Fluorescence Resonance Energy Transfer (TR-FRET) Assay
Ki 7.453±n/a nM
Citation Bruncko, MDing, HDoherty, GAElmore, SWHasvold, LHexamer, LAKunzer, ARMantei, RAMcClellan, WJPark, CHPark, CPetros, AMSong, XSouers, AJSullivan, GMTao, ZWang, GTWang, LWang, XWendt, MD Bcl-2-selective apoptosis-inducing agents for the treatment of cancer and immune diseases US Patent US9125913 Publication Date 9/8/2015
 
Bcl-2-like protein 1
Name:Bcl-2-like protein 1
Type:Protein
Mol. Mass.:26122.63
Organism:Mus musculus (Mouse)
Description:Q64373
Residue:233
BDBM178839
NameBDBM178839
Synonyms:US9125913, 411
TypeSmall organic molecule
Emp. Form.C47H53ClN8O7S
Mol. Mass.909.491
SMILESCC1(C)CCC(CN2CCN(CC2)c2ccc(C(=O)NS(=O)(=O)c3ccc(NCC4CN(CCO4)C4CC4)c(c3)[N+]([O-])=O)c(Oc3cccc4[nH]ncc34)c2)=C(C1)c1ccc(Cl)cc1