Reaction Details
TargetBcl-2-like protein 1
LigandBDBM178846
Substrate/Competitorn/a
Meas. Tech.Time Resolved-Fluorescence Resonance Energy Transfer (TR-FRET) Assay
Ki 1.566±n/a nM
Citation Bruncko, MDing, HDoherty, GAElmore, SWHasvold, LHexamer, LAKunzer, ARMantei, RAMcClellan, WJPark, CHPark, CPetros, AMSong, XSouers, AJSullivan, GMTao, ZWang, GTWang, LWang, XWendt, MD Bcl-2-selective apoptosis-inducing agents for the treatment of cancer and immune diseases US Patent US9125913 Publication Date 9/8/2015
 
Bcl-2-like protein 1
Name:Bcl-2-like protein 1
Type:Protein
Mol. Mass.:26122.63
Organism:Mus musculus (Mouse)
Description:Q64373
Residue:233
BDBM178846
NameBDBM178846
Synonyms:US9125913, 418
TypeSmall organic molecule
Emp. Form.C45H51ClN8O6S
Mol. Mass.867.454
SMILESCN1CCC(CC1)Nc1ccc(cc1[N+]([O-])=O)S(=O)(=O)NC(=O)c1ccc(cc1Oc1cccc2[nH]cnc12)N1CCN(CC2=C(CC(C)(C)CC2)c2ccc(Cl)cc2)CC1