Reaction Details
TargetBromodomain-containing protein 4/Histone H4
LigandBDBM179290
Substrate/Competitorn/a
Meas. Tech.Time Resolved Fluorescence Resonance Energy Transfer (TR-FRET) Assay
Temperature298.15±n/a K
IC50 119.8±n/a nM
Commentsextracted
Citation Miyoshi, SOoike, SIwata, KHikawa, HSugahara, K Antitumor agent US Patent US9125915 Publication Date 9/8/2015
 
Bromodomain-containing protein 4/Histone H4
Name:Bromodomain-containing protein 4/Histone H4
Synonyms:H4-BRD4
Type:Protein
Mol. Mass.:n/a
Description:n/a
Components:This complex has 2 components.
Component 1
Name:Histone H4
Type:Protein
Mol. Mass.:11386.36
Organism:Homo sapiens (Human)
Description:P62805
Residue:103
Component 2
Name:Bromodomain-containing protein 4
Synonyms:BRD4 Bromodomain-containing protein 4 (BRD4) Protein HUNK1
Type:Protein
Mol. Mass.:152264.84
Organism:Homo sapiens (Human)
Description:O60885
Residue:1362
BDBM179290
NameBDBM179290
Synonyms:US9125915, compound 15
TypeSmall organic molecule
Emp. Form.C25H23ClN6OS
Mol. Mass.491.008
SMILESCc1sc-2c(c1C)C(=NC(CC(=O)Nc1ccc(N)cc1)c1nnc(C)n-21)c1ccc(Cl)cc1