Reaction Details
TargetBromodomain-containing protein 4/Histone H4
LigandBDBM179279
Substrate/Competitorn/a
Meas. Tech.Time Resolved Fluorescence Resonance Energy Transfer (TR-FRET) Assay
Temperature298.15±n/a K
IC50 146.8±n/a nM
Commentsextracted
Citation Miyoshi, SOoike, SIwata, KHikawa, HSugahara, K Antitumor agent US Patent US9125915 Publication Date 9/8/2015
 
Bromodomain-containing protein 4/Histone H4
Name:Bromodomain-containing protein 4/Histone H4
Synonyms:H4-BRD4
Type:Protein
Mol. Mass.:n/a
Description:n/a
Components:This complex has 2 components.
Component 1
Name:Histone H4
Type:Protein
Mol. Mass.:11386.36
Organism:Homo sapiens (Human)
Description:P62805
Residue:103
Component 2
Name:Bromodomain-containing protein 4
Synonyms:BRD4 Bromodomain-containing protein 4 (BRD4) Protein HUNK1
Type:Protein
Mol. Mass.:152264.84
Organism:Homo sapiens (Human)
Description:O60885
Residue:1362
BDBM179279
NameBDBM179279
Synonyms:US9125915, compound 18
TypeSmall organic molecule
Emp. Form.C25H23ClN6O2S
Mol. Mass.507.007
SMILESCOc1ncccc1NC(=O)C[C@@H]1N=C(c2c(C)c(C)sc2-n2c(C)nnc12)c1ccc(Cl)cc1