Reaction Details
TargetALK tyrosine kinase receptor
LigandBDBM179295
Substrate/Competitorn/a
Meas. Tech.Kinase Assay
Temperature305.15±n/a K
IC50<1±0 nM
Commentsextracted
Citation Liang, C Substituted pyridazine carboxamide compounds US Patent US9126947 Publication Date 9/8/2015
 
ALK tyrosine kinase receptor
Name:ALK tyrosine kinase receptor
Type:Protein
Mol. Mass.:176453.10
Organism:Homo sapiens (Human)
Description:Q9UM73
Residue:1620
BDBM179295
NameBDBM179295
Synonyms:US9126947, 16
TypeSmall organic molecule
Emp. Form.C25H25Cl2FN6O3
Mol. Mass.547.409
SMILESC[C@@H](Oc1cc(nnc1N)C(=O)Nc1ccc(cc1)C(=O)N1CCCNCC1)c1c(Cl)ccc(F)c1Cl