Reaction Details
TargetProtein O-GlcNAcase
LigandBDBM179366
Substrate/Competitorn/a
Meas. Tech.Enzyme Assay
pH7±n/a
Temperature298.15±n/a K
Ki 0.26±n/a nM
Commentsextracted
Citation Selnick, HGLiu, KMcEachern, EJZhou, YZhu, Y Selective glycosidase inhibitors and uses thereof US Patent US9126957 Publication Date 9/8/2015
 
Protein O-GlcNAcase
Name:Protein O-GlcNAcase
Type:Enzyme
Mol. Mass.:102874.67
Organism:Homo sapiens (Human)
Description:O60502
Residue:916
BDBM179366
NameBDBM179366
Synonyms:US9126957, 2
TypeSmall organic molecule
Emp. Form.C11H20N2O4
Mol. Mass.244.2875
SMILESC[C@H](O)[C@H]1C[C@@H]2OC(=N[C@@H]2[C@@H](O)[C@@H]1O)N(C)C