Reaction Details
TargetHematopoietic prostaglandin D synthase
LigandBDBM179428
Substrate/Competitorn/a
Meas. Tech.Fluorescence Polarization Binding Assay (FPBA)
Temperature298.15±n/a K
IC50 600±n/a nM
Commentsextracted
Citation Endres, GWLee, PHOlson, KLKramer, JBCiske, FLBarrett, SD Multiheteroaryl compounds as inhibitors of H-PGDS and their use for treating prostaglandin D2 mediated diseases US Patent US9126973 Publication Date 9/8/2015
 
Hematopoietic prostaglandin D synthase
Name:Hematopoietic prostaglandin D synthase
Type:Enzyme
Mol. Mass.:23341.07
Organism:Homo sapiens (Human)
Description:The protein was expressed in E. coli strain BL21(DE3) with an N-terminal 6-His tag.
Residue:199
BDBM179428
NameBDBM179428
Synonyms:US9126973, 23
TypeSmall organic molecule
Emp. Form.C25H25N5
Mol. Mass.395.4995
SMILESC(N1CCCC(C1)c1ncc([nH]1)-c1cnc(nc1)-c1ccccc1)c1ccccc1