Reaction Details
TargetHematopoietic prostaglandin D synthase
LigandBDBM179430
Substrate/Competitorn/a
Meas. Tech.Fluorescence Polarization Binding Assay (FPBA)
Temperature298.15±n/a K
IC50 300±n/a nM
Commentsextracted
Citation Endres, GWLee, PHOlson, KLKramer, JBCiske, FLBarrett, SD Multiheteroaryl compounds as inhibitors of H-PGDS and their use for treating prostaglandin D2 mediated diseases US Patent US9126973 Publication Date 9/8/2015
 
Hematopoietic prostaglandin D synthase
Name:Hematopoietic prostaglandin D synthase
Type:Enzyme
Mol. Mass.:23341.07
Organism:Homo sapiens (Human)
Description:The protein was expressed in E. coli strain BL21(DE3) with an N-terminal 6-His tag.
Residue:199
BDBM179430
NameBDBM179430
Synonyms:US9126973, 25
TypeSmall organic molecule
Emp. Form.C22H25N7O2
Mol. Mass.419.4796
SMILESCNC(=O)N1CCCC(C1)c1nc(cn1C(=O)NC)-c1cnc(nc1)-c1ccccc1