Reaction Details
TargetHematopoietic prostaglandin D synthase
LigandBDBM179407
Substrate/Competitorn/a
Meas. Tech.Enzyme Immunoassay (EIA))
pH8±n/a
Temperature298.15±n/a K
IC50 53±n/a nM
Commentsextracted
Citation Endres, GWLee, PHOlson, KLKramer, JBCiske, FLBarrett, SD Multiheteroaryl compounds as inhibitors of H-PGDS and their use for treating prostaglandin D2 mediated diseases US Patent US9126973 Publication Date 9/8/2015
 
Hematopoietic prostaglandin D synthase
Name:Hematopoietic prostaglandin D synthase
Type:Enzyme
Mol. Mass.:23341.07
Organism:Homo sapiens (Human)
Description:The protein was expressed in E. coli strain BL21(DE3) with an N-terminal 6-His tag.
Residue:199
BDBM179407
NameBDBM179407
Synonyms:US9126973, 9
TypeSmall organic molecule
Emp. Form.C18H13N5
Mol. Mass.299.3293
SMILESc1nc([nH]c1-c1cnc(nc1)-c1ccccc1)-c1ccccn1