Reaction Details
TargetPotassium channel subfamily K member 3
LigandBDBM179661
Substrate/Competitorn/a
Meas. Tech.Biological Assay
Temperature298.15±n/a K
IC50 258±n/a nM
Commentsextracted
Citation Bialy, LLorenz, KWirth, KSteinmeyer, KHessler, GPernerstorfer, JBrendel, J Substituted 4,5,6,7-tetrahydro-1H-pyrazolo[4,3-c]pyridines, their use as medicament, and pharmaceutical preparations comprising them US Patent US9127001 Publication Date 9/8/2015
 
Potassium channel subfamily K member 3
Name:Potassium channel subfamily K member 3
Type:Protein
Mol. Mass.:43534.71
Organism:Homo sapiens (Human)
Description:O14649
Residue:394
BDBM179661
NameBDBM179661
Synonyms:US9127001, 6ao | US9598410, Compound 6ao
TypeSmall organic molecule
Emp. Form.C24H23F2N3O
Mol. Mass.407.4557
SMILESCC(=O)N1CCc2c(C1)c(nn2C(C1CC1)c1ccc(F)cc1)-c1ccc(F)cc1