Reaction Details
TargetPotassium channel subfamily K member 3
LigandBDBM179629
Substrate/Competitorn/a
Meas. Tech.Biological Assay
Temperature298.15±n/a K
IC50 99.5±n/a nM
Commentsextracted
Citation Bialy, LLorenz, KWirth, KSteinmeyer, KHessler, GPernerstorfer, JBrendel, J Substituted 4,5,6,7-tetrahydro-1H-pyrazolo[4,3-c]pyridines, their use as medicament, and pharmaceutical preparations comprising them US Patent US9127001 Publication Date 9/8/2015
 
Potassium channel subfamily K member 3
Name:Potassium channel subfamily K member 3
Type:Protein
Mol. Mass.:43534.71
Organism:Homo sapiens (Human)
Description:O14649
Residue:394
BDBM179629
NameBDBM179629
Synonyms:US9127001, 6g | US9598410, Compound 6g
TypeSmall organic molecule
Emp. Form.C21H18F4N4O
Mol. Mass.418.3874
SMILESCC(=O)N1CCc2c(C1)c(nn2Cc1ccc(F)cc1)-c1cccc(n1)C(F)(F)F