Reaction Details
TargetIsoform 2 of Hepatocyte growth factor receptor (2)
LigandBDBM179800
Substrate/Competitorn/a
Meas. Tech.c-Met Z-LYTE Assay
pH7±n/a
Temperature298.15±n/a K
IC50 63±0.0 nM
Commentsextracted
Citation Liu, NWang, YHuang, GJi, CFan, WLi, HCheng, YTian, H Design, synthesis and biological evaluation of 1H-pyrrolo[2,3-b]pyridine and 1H-pyrazolo[3,4-b]pyridine derivatives as c-Met inhibitors. Bioorg Chem65:146-58 (2016) 
 
Isoform 2 of Hepatocyte growth factor receptor (2)
Name:Isoform 2 of Hepatocyte growth factor receptor (2)
Type:Protein
Mol. Mass.:157730.26
Organism:Homo sapiens (Human)
Description:P08581-2
Residue:1408
BDBM179800
NameBDBM179800
Synonyms:3-((2,6-dichloro-3-fluorophenyl)sulfide)-5-(1-(piperidin-4-yl)-1H-pyrazol-4-yl)-1Hpyrrolo[2,3-b]pyridine (8)
TypeSmall organic molecule
Emp. Form.C21H18Cl2FN5OS
Mol. Mass.478.37
SMILESFc1ccc(Cl)c(c1Cl)S(=O)c1c[nH]c2ncc(cc12)-c1cnn(c1)C1CCNCC1