Reaction Details
TargetPC4 and SFRS1-interacting protein
LigandBDBM179842
Substrate/Competitorn/a
Meas. Tech.Alpha Screen Interaction Assay
pH7.4±n/a
Temperature277.15±n/a K
IC50 4600±n/a nM
Commentsextracted
Citation Chaltin, PChrist, FDebyser, ZDe Maeyer, MMarchand, AMarchand, DVoet, A Antiviral compounds US Patent US9132129 Publication Date 9/15/2015
 
PC4 and SFRS1-interacting protein
Name:PC4 and SFRS1-interacting protein
Type:Enzyme Catalytic Domain
Mol. Mass.:60120.68
Organism:Homo sapiens (Human)
Description:gi_6708281
Residue:530
BDBM179842
NameBDBM179842
Synonyms:US9132129, Cpd023
TypeSmall organic molecule
Emp. Form.C25H27NO2
Mol. Mass.373.4874
SMILESCCCC(C(O)=O)c1c(C)nc2ccc3CCCc3c2c1-c1ccc(C)cc1