Reaction Details
TargetMu-type opioid receptor
LigandBDBM179904
Substrate/Competitorn/a
Meas. Tech.n/a
pH7.5±n/a
Temperature298.15±n/a K
Ki 0.05±n/a nM
IC50 58±n/a nM
Commentsextracted
Citation Blumberg, LCDeaver, DEyerman, D Morphan and morphinan analogues, and methods of use US Patent US9133125 Publication Date 9/15/2015
 
Mu-type opioid receptor
Name:Mu-type opioid receptor
Type:G Protein-Coupled Receptor (GPCR)
Mol. Mass.:44789.51
Organism:Homo sapiens (Human)
Description:P35372
Residue:400
BDBM179904
NameBDBM179904
Synonyms:US10231963, Table C.8 US10736890, Compound TABLE C.8 US11534436, Compound Table C.8 US9656961, Example 00172
TypeSmall organic molecule
Emp. Form.C20H28N2O2
Mol. Mass.328.4485
SMILESC[C@H]1[C@H]2Cc3ccc(cc3[C@@]1(C)CCN2C[C@H]1CCCO1)C(N)=O