Reaction Details
TargetMu-type opioid receptor
LigandBDBM179879
Substrate/Competitorn/a
Meas. Tech.Functional Assay (GTPgammaS Binding)
pH7.4±n/a
EC50 1.5±n/a nM
Commentsextracted
Citation Blumberg, LCDeaver, DEyerman, D Morphan and morphinan analogues, and methods of use US Patent US9133125 Publication Date 9/15/2015
 
Mu-type opioid receptor
Name:Mu-type opioid receptor
Type:G Protein-Coupled Receptor (GPCR)
Mol. Mass.:44789.51
Organism:Homo sapiens (Human)
Description:P35372
Residue:400
BDBM179879
NameBDBM179879
Synonyms:US10231963, Table B.25 US10736890, Compound TABLE B.25 US11534436, Compound Table B.25 US9656961, Example 00142
TypeSmall organic molecule
Emp. Form.C22H30N2O3
Mol. Mass.370.4852
SMILESNC(=O)c1ccc2C[C@@H]3[C@@H]4CC[C@@H](O)C[C@]4(CCN3CC3CCC3)c2c1O