Reaction Details
TargetGag-Pol polyprotein
LigandBDBM180119
Substrate/Competitorn/a
Meas. Tech.Inhibition Assay
pH5.5±n/a
Temperature298.15±n/a K
IC50 0.31±n/a nM
Commentsextracted
Citation Boyd, MJChiasson, JCrane, SGiroux, A HIV protease inhibitors US Patent US9133157 Publication Date 9/15/2015
 
Gag-Pol polyprotein
Name:Gag-Pol polyprotein
Type:Protein
Mol. Mass.:162074.74
Organism:Human immunodeficiency virus type 1 group M subtype B (isolate HXB2)
Description:P04585
Residue:1435
BDBM180119
NameBDBM180119
Synonyms:US9133157, 8
TypeSmall organic molecule
Emp. Form.C37H45N3O7S2
Mol. Mass.707.899
SMILESCOC(=O)N[C@@H](C(c1ccccc1)c1ccccc1)C(=O)NC(C)c1ccc(s1)C(CO)N(CCC(C)C)S(=O)(=O)c1ccc(CO)cc1