Reaction Details
TargetGag-Pol polyprotein
LigandBDBM180135
Substrate/Competitorn/a
Meas. Tech.Inhibition Assay
pH5.5±n/a
Temperature298.15±n/a K
IC50 0.44±n/a nM
Commentsextracted
Citation Boyd, MJChiasson, JCrane, SGiroux, A HIV protease inhibitors US Patent US9133157 Publication Date 9/15/2015
 
Gag-Pol polyprotein
Name:Gag-Pol polyprotein
Type:Protein
Mol. Mass.:162074.74
Organism:Human immunodeficiency virus type 1 group M subtype B (isolate HXB2)
Description:P04585
Residue:1435
BDBM180135
NameBDBM180135
Synonyms:US9133157, 16
TypeSmall organic molecule
Emp. Form.C38H38F2N4O7S2
Mol. Mass.764.858
SMILESCOC(=O)N[C@@H](C(c1ccccc1)c1ccccc1)C(=O)NCc1ccc(s1)[C@@H](CO)N(CC1CC(F)(F)C1)S(=O)(=O)c1ccc2cc[nH]c(=O)c2c1