Reaction Details
TargetGag-Pol polyprotein
LigandBDBM180147
Substrate/Competitorn/a
Meas. Tech.Inhibition Assay
pH5.5±n/a
Temperature298.15±n/a K
IC50 1.45±n/a nM
Commentsextracted
Citation Boyd, MJChiasson, JCrane, SGiroux, A HIV protease inhibitors US Patent US9133157 Publication Date 9/15/2015
 
Gag-Pol polyprotein
Name:Gag-Pol polyprotein
Type:Protein
Mol. Mass.:162074.74
Organism:Human immunodeficiency virus type 1 group M subtype B (isolate HXB2)
Description:P04585
Residue:1435
BDBM180147
NameBDBM180147
Synonyms:US9133157, 28
TypeSmall organic molecule
Emp. Form.C38H37N5O7S3
Mol. Mass.771.925
SMILESCOC(=O)N[C@@H](C(c1ccccc1)c1ccccc1)C(=O)NCc1ccc(s1)[C@@H](CO)N(Cc1ccnc(OC)c1)S(=O)(=O)c1ccc2scnc2c1