Reaction Details
TargetGag-Pol polyprotein
LigandBDBM180206
Substrate/Competitorn/a
Meas. Tech.Inhibition Assay
pH5.5±n/a
Temperature298.15±n/a K
IC50 0.33±n/a nM
Commentsextracted
Citation Boyd, MJChiasson, JCrane, SGiroux, A HIV protease inhibitors US Patent US9133157 Publication Date 9/15/2015
 
Gag-Pol polyprotein
Name:Gag-Pol polyprotein
Type:Protein
Mol. Mass.:162074.74
Organism:Human immunodeficiency virus type 1 group M subtype B (isolate HXB2)
Description:P04585
Residue:1435
BDBM180206
NameBDBM180206
Synonyms:US9133157, 88
TypeSmall organic molecule
Emp. Form.C35H39F3N4O6S2
Mol. Mass.732.833
SMILESCCCCN([C@H](CO)c1ccc(s1)[C@@H](NC(=O)[C@@H](NC(=O)OC)C(c1ccccc1)c1ccccc1)C(F)(F)F)S(=O)(=O)c1ccc(N)cc1