Reaction Details
TargetGag-Pol polyprotein
LigandBDBM180207
Substrate/Competitorn/a
Meas. Tech.Inhibition Assay
pH5.5±n/a
Temperature298.15±n/a K
IC50 2.6±n/a nM
Commentsextracted
Citation Boyd, MJChiasson, JCrane, SGiroux, A HIV protease inhibitors US Patent US9133157 Publication Date 9/15/2015
 
Gag-Pol polyprotein
Name:Gag-Pol polyprotein
Type:Protein
Mol. Mass.:162074.74
Organism:Human immunodeficiency virus type 1 group M subtype B (isolate HXB2)
Description:P04585
Residue:1435
BDBM180207
NameBDBM180207
Synonyms:US9133157, 89
TypeSmall organic molecule
Emp. Form.C39H39F3N4O6S2
Mol. Mass.780.875
SMILESCOC(=O)N[C@@H](C(c1ccccc1)c1ccccc1)C(=O)N[C@H](c1ccc(s1)[C@@H](CO)N(CCc1ccccc1)S(=O)(=O)c1ccc(N)cc1)C(F)(F)F