Reaction Details
Target5-hydroxytryptamine receptor 2A
LigandBDBM180698
Substrate/Competitorn/a
Meas. Tech.Radioligand Binding Assay
Ki 1.739±n/a nM
Citation Gobbi, LJaeschke, GRoche, OSarmiento, RMSteward, L Dual modulators of 5HT2A and D3 receptors US Patent US8829029 Publication Date 9/9/2014
 
5-hydroxytryptamine receptor 2A
Name:5-hydroxytryptamine receptor 2A
Type:undefined
Mol. Mass.:52607.65
Organism:Homo sapiens (Human)
Description:P28223
Residue:471
BDBM180698
NameBDBM180698
Synonyms:US8829029, 2
TypeSmall organic molecule
Emp. Form.C26H36FN3O3
Mol. Mass.457.5807
SMILESFc1ccc2c(noc2c1)C1CCN(CC[C@H]2CC[C@@H](CC2)NC(=O)C2CCOCC2)CC1