Reaction Details
Target5-hydroxytryptamine receptor 2A
LigandBDBM180719
Substrate/Competitorn/a
Meas. Tech.Radioligand Binding Assay
Ki 2.257±n/a nM
Citation Gobbi, LJaeschke, GRoche, OSarmiento, RMSteward, L Dual modulators of 5HT2A and D3 receptors US Patent US8829029 Publication Date 9/9/2014
 
5-hydroxytryptamine receptor 2A
Name:5-hydroxytryptamine receptor 2A
Type:undefined
Mol. Mass.:52607.65
Organism:Homo sapiens (Human)
Description:P28223
Residue:471
BDBM180719
NameBDBM180719
Synonyms:US8829029, 19
TypeSmall organic molecule
Emp. Form.C26H33F4N3O2
Mol. Mass.495.5527
SMILESFc1ccc2c(noc2c1)C1CCN(CC[C@H]2CC[C@@H](CC2)NC(=O)C2(CCC2)C(F)(F)F)CC1