Reaction Details
TargetCyclin-dependent kinase 9
LigandBDBM180812
Substrate/Competitorn/a
Meas. Tech.CDK9/CycT1 Kinase Assay
pH8±n/a
Temperature295.15±n/a K
IC50 3±n/a nM
Commentsextracted
Citation Lücking, UKosemund, DScholz, ALienau, PSiemeister, GBömer, UBohlmann, R Disubstituted 5-fluoro pyrimidine derivatives containing a sulfoximine group US Patent US9133171 Publication Date 9/15/2015
 
Cyclin-dependent kinase 9
Name:Cyclin-dependent kinase 9
Type:Enzyme Subunit
Mol. Mass.:42789.13
Organism:Homo sapiens (Human)
Description:n/a
Residue:372
BDBM180812
NameBDBM180812
Synonyms:US9133171, 17 US9133171, 19
TypeSmall organic molecule
Emp. Form.C20H17F2N5O2S
Mol. Mass.429.443
SMILESCOc1cc(F)ccc1-c1nc(Nc2cccc(CS(C)(=O)=NC#N)c2)ncc1F