Reaction Details
TargetCyclin-dependent kinase 9
LigandBDBM180824
Substrate/Competitorn/a
Meas. Tech.CDK9/CycT1
pH8±n/a
Temperature295.15±n/a K
IC50 2±n/a nM
Commentsextracted
Citation Lücking, UKosemund, DScholz, ALienau, PSiemeister, GBömer, UBohlmann, R Disubstituted 5-fluoro pyrimidine derivatives containing a sulfoximine group US Patent US9133171 Publication Date 9/15/2015
 
Cyclin-dependent kinase 9
Name:Cyclin-dependent kinase 9
Type:Enzyme Subunit
Mol. Mass.:42789.13
Organism:Homo sapiens (Human)
Description:n/a
Residue:372
BDBM180824
NameBDBM180824
Synonyms:US9133171, 29 US9133171, 31
TypeSmall organic molecule
Emp. Form.C19H17BrF2N4O2S
Mol. Mass.483.33
SMILESCOc1cc(F)ccc1-c1nc(Nc2cc(Br)cc(CS(C)(=N)=O)c2)ncc1F