Reaction Details
TargetAurora kinase B
LigandBDBM180861
Substrate/Competitorn/a
Meas. Tech.Inhibition Assay
pH7.5±n/a
Temperature298.15±n/a K
IC50 5.9±n/a nM
Commentsextracted
Citation Reader, JC Aurora and FLT3 kinases modulators US Patent US9133180 Publication Date 9/15/2015
 
Aurora kinase B
Name:Aurora kinase B
Type:Protein
Mol. Mass.:39327.72
Organism:Homo sapiens (Human)
Description:Q96GD4
Residue:344
BDBM180861
NameBDBM180861
Synonyms:US9133180, 2
TypeSmall organic molecule
Emp. Form.C25H27N5O2
Mol. Mass.429.5142
SMILESCc1ccc2[nH]ccc2c1-c1nc(C(N)=O)c(o1)-c1ccc(cc1)N1CCNC(C)(C)C1