Reaction Details
TargetReceptor-type tyrosine-protein kinase FLT3
LigandBDBM180864
Substrate/Competitorn/a
Meas. Tech.Inhibition Assay
pH7.5±n/a
Temperature298.15±n/a K
IC50 0.89±n/a nM
Commentsextracted
Citation Reader, JC Aurora and FLT3 kinases modulators US Patent US9133180 Publication Date 9/15/2015
 
Receptor-type tyrosine-protein kinase FLT3
Name:Receptor-type tyrosine-protein kinase FLT3
Type:Enzyme
Mol. Mass.:112888.62
Organism:Homo sapiens (Human)
Description:P36888
Residue:993
BDBM180864
NameBDBM180864
Synonyms:US9133180, 5
TypeSmall organic molecule
Emp. Form.C25H27N5O3
Mol. Mass.445.5136
SMILESCOc1ccc(-c2nc(C(N)=O)c(o2)-c2ccc(cc2)N2CCNC(C)(C)C2)c2cc[nH]c12