Reaction Details
TargetMacrophage colony-stimulating factor 1 receptor [538-972]
LigandBDBM181027
Substrate/Competitorn/a
Meas. Tech.Enzymatic Assay
pH7.5±n/a
Temperature303.15±n/a K
IC50 5±n/a nM
Commentsextracted
Citation Flynn, DLKaufman, MDSamarakoon, TCaldwell, TMVogeti, LAhn, YPatt, WCYates, KM Imidazolidinones and analogs exhibiting anti-cancer and anti-proliferative activities US Patent US9133183 Publication Date 9/15/2015
 
Macrophage colony-stimulating factor 1 receptor [538-972]
Name:Macrophage colony-stimulating factor 1 receptor [538-972]
Type:Other Protein Type
Mol. Mass.:48843.65
Organism:Homo sapiens (Human)
Description:Recombinant protein contains the full-length FMS cytoplasmic domain (FMS538-972.6His).
Residue:435
BDBM181027
NameBDBM181027
Synonyms:US9133183, Example 90
TypeSmall organic molecule
Emp. Form.C20H24N6O4
Mol. Mass.412.4424
SMILESCNC(=O)c1cc(Oc2ccc(NC(=O)N3CCN(C3=O)C(C)(C)C)nc2)ccn1