Reaction Details
TargetHepatocyte growth factor receptor
LigandBDBM181019
Substrate/Competitorn/a
Meas. Tech.In Vitro Receptor Tyrosine Kinase Assay
Temperature300.15±n/a K
IC50 370±n/a nM
Commentsextracted
Citation Flynn, DLKaufman, MDSamarakoon, TCaldwell, TMVogeti, LAhn, YPatt, WCYates, KM Imidazolidinones and analogs exhibiting anti-cancer and anti-proliferative activities US Patent US9133183 Publication Date 9/15/2015
 
Hepatocyte growth factor receptor
Name:Hepatocyte growth factor receptor
Type:Protein
Mol. Mass.:155559.73
Organism:Homo sapiens (Human)
Description:P08581
Residue:1390
BDBM181019
NameBDBM181019
Synonyms:US9133183, Example 15
TypeSmall organic molecule
Emp. Form.C24H27N7O3
Mol. Mass.461.5163
SMILESCn1cc(cn1)-c1cc(Oc2ccc(NC(=O)N3CCN(C4CCCCC4)C3=O)nc2)ccn1