Reaction Details
TargetAdenosine receptor A2a
LigandBDBM181013
Substrate/Competitorn/a
Meas. Tech.Competition Binding Assay
pH7.4±n/a
Ki 22±n/a nM
Commentsextracted
Citation Cabri, WMinetti, PPiersanti, GTarzia, G Oxidated derivatives of triazolylpurines useful as ligands of the adenosine A2A receptor and their use as medicaments US Patent US9133197 Publication Date 9/15/2015
 
Adenosine receptor A2a
Name:Adenosine receptor A2a
Type:G Protein-Coupled Receptor (GPCR)
Mol. Mass.:44716.46
Organism:Homo sapiens (Human)
Description:P29274
Residue:412
BDBM181013
NameBDBM181013
Synonyms:US9133197, 5
TypeSmall organic molecule
Emp. Form.C12H16N8O
Mol. Mass.288.3084
SMILESCCCC(O)c1nc(N)c2nc(-n3nccn3)n(C)c2n1