Reaction Details
TargetSerine/threonine-protein kinase PLK1
LigandBDBM181016
Substrate/Competitorn/a
Meas. Tech.Kinase Assay
pH7.5±n/a
Ki<10±0.0 nM
Commentsextracted
Citation Hollick, JJJones, SDFlynn, CJThomas, MG Pyrimidine derivatives as protein kinase inhibitors US Patent US9133199 Publication Date 9/15/2015
 
Serine/threonine-protein kinase PLK1
Name:Serine/threonine-protein kinase PLK1
Type:Serine/threonine-protein kinase
Mol. Mass.:68277.16
Organism:Homo sapiens (Human)
Description:P53350
Residue:603
BDBM181016
NameBDBM181016
Synonyms:US9133199, I-253
TypeSmall organic molecule
Emp. Form.C27H35N7O3
Mol. Mass.505.6119
SMILESCOc1cc(ccc1Nc1ncc2N(C)C(=O)C3(CC3)CN(C3CCCC3)c2n1)C(=O)NN1CCCC1