Reaction Details
TargetPhosphoenolpyruvate carboxykinase, cytosolic [GTP]
LigandBDBM181109
Substrate/CompetitorBDBM181110
Meas. Tech.PEPCK Assay (OAA to PEP-allosteric)
Temperature298.15±0 K
Ki 1.21e+5± 3.5e+4 nM
Citation Balan, MDMcleod, MJLotosky, WRGhaly, MHolyoak, T Inhibition and Allosteric Regulation of Monomeric Phosphoenolpyruvate Carboxykinase by 3-Mercaptopicolinic Acid. Biochemistry54:5878-87 (2015) 
 
Phosphoenolpyruvate carboxykinase, cytosolic [GTP]
Name:Phosphoenolpyruvate carboxykinase, cytosolic [GTP]
Type:Protein
Mol. Mass.:69414.48
Organism:Rattus norvegicus (Rat)
Description:n/a
Residue:622
BDBM181109
BDBM181110
NameBDBM181109
Synonyms:3-Mercaptopicolinic acid (MPA)
TypeSmall organic molecule
Emp. Form.C6H5NO2S
Mol. Mass.155.174
SMILESOC(=O)c1ncccc1S