Reaction Details
TargetCytochrome P450 3A4
LigandBDBM50028166
Substrate/Competitorn/a
Meas. Tech.n/a
IC50 3000±n/a nM
Citation Bareja, SPJones, SDOblong, JEMills, KJBierman, JC Cosmetic compositions containing substituted azole and methods for improving the appearance of aging skin US Patent US9138393 Publication Date 9/22/2015
 
Cytochrome P450 3A4
Name:Cytochrome P450 3A4
Type:Enzyme
Mol. Mass.:57349.57
Organism:Homo sapiens (Human)
Description:n/a
Residue:503
BDBM50028166
NameBDBM50028166
Synonyms:CHEMBL934 US9138393, Metyrapone US9394290, MTP (metyrapone)
TypeSmall organic molecule
Emp. Form.C14H14N2O
Mol. Mass.226.2738
SMILESCC(C)(C(=O)c1cccnc1)c1cccnc1