Reaction Details
TargetCytochrome P450 3A4
LigandBDBM25817
Substrate/Competitorn/a
Meas. Tech.n/a
IC50 10000±n/a nM
Citation Bareja, SPJones, SDOblong, JEMills, KJBierman, JC Cosmetic compositions containing substituted azole and methods for improving the appearance of aging skin US Patent US9138393 Publication Date 9/22/2015
 
Cytochrome P450 3A4
Name:Cytochrome P450 3A4
Type:Enzyme
Mol. Mass.:57349.57
Organism:Homo sapiens (Human)
Description:n/a
Residue:503
BDBM25817
NameBDBM25817
Synonyms:2-(2,4-difluorophenyl)-1,3-bis(1H-1,2,4-triazol-1-yl)propan-2-ol Diflucan Fluconazole (f) Triflucan US11247981, Example Fluconazole US9144538, Fluconazole US9556143, Fluconazole | cid_3365
TypeSmall organic molecule
Emp. Form.C13H12F2N6O
Mol. Mass.306.2708
SMILESOC(Cn1cncn1)(Cn1cncn1)c1ccc(F)cc1F