Reaction Details
TargetCytochrome P450 3A4
LigandBDBM181121
Substrate/Competitorn/a
Meas. Tech.n/a
IC50>10000±n/a nM
Citation Bareja, SPJones, SDOblong, JEMills, KJBierman, JC Cosmetic compositions containing substituted azole and methods for improving the appearance of aging skin US Patent US9138393 Publication Date 9/22/2015
 
Cytochrome P450 3A4
Name:Cytochrome P450 3A4
Type:Enzyme
Mol. Mass.:57349.57
Organism:Homo sapiens (Human)
Description:n/a
Residue:503
BDBM181121
NameBDBM181121
Synonyms:US9138393, Metolachlor
TypeSmall organic molecule
Emp. Form.C15H22ClNO2
Mol. Mass.283.794
SMILESCCc1cccc(C)c1N(C(C)CCO)C(=O)CCl