Reaction Details
TargetCytochrome P450 3A4
LigandBDBM7939
Substrate/Competitorn/a
Meas. Tech.n/a
IC50>10000±n/a nM
Citation Bareja, SPJones, SDOblong, JEMills, KJBierman, JC Cosmetic compositions containing substituted azole and methods for improving the appearance of aging skin US Patent US9138393 Publication Date 9/22/2015
 
Cytochrome P450 3A4
Name:Cytochrome P450 3A4
Type:Enzyme
Mol. Mass.:57349.57
Organism:Homo sapiens (Human)
Description:n/a
Residue:503
BDBM7939
NameBDBM7939
Synonyms:1H-1,3-benzodiazole Benzimidazole (Blm) US9144538, Benzimidazole
TypeSmall organic molecule
Emp. Form.C7H6N2
Mol. Mass.118.1359
SMILESc1nc2ccccc2[nH]1