Reaction Details
TargetCytochrome P450 3A4
LigandBDBM3789
Substrate/Competitorn/a
Meas. Tech.n/a
IC50>10000±n/a nM
Citation Bareja, SPJones, SDOblong, JEMills, KJBierman, JC Cosmetic compositions containing substituted azole and methods for improving the appearance of aging skin US Patent US9138393 Publication Date 9/22/2015
 
Cytochrome P450 3A4
Name:Cytochrome P450 3A4
Type:Enzyme
Mol. Mass.:57349.57
Organism:Homo sapiens (Human)
Description:n/a
Residue:503
BDBM3789
NameBDBM3789
Synonyms:1-Phenylbenzimidazole Analog 6 US9138393, 2-Phenyl benzimidazole cid_12855
TypeSmall organic molecule
Emp. Form.C13H10N2
Mol. Mass.194.2319
SMILESc1ccc(cc1)-c1nc2ccccc2[nH]1