Reaction Details
TargetCytochrome P450 3A4
LigandBDBM7942
Substrate/Competitorn/a
Meas. Tech.n/a
IC50>10000±n/a nM
Citation Bareja, SPJones, SDOblong, JEMills, KJBierman, JC Cosmetic compositions containing substituted azole and methods for improving the appearance of aging skin US Patent US9138393 Publication Date 9/22/2015
 
Cytochrome P450 3A4
Name:Cytochrome P450 3A4
Type:Enzyme
Mol. Mass.:57349.57
Organism:Homo sapiens (Human)
Description:n/a
Residue:503
BDBM7942
NameBDBM7942
Synonyms:1-Subsituted 1H-imidazole, 8 1-ethenyl-1H-imidazole US9138393, 1-Vinylimidazole | US9144538, 1-Vinylimidazole
TypeSmall organic molecule
Emp. Form.C5H6N2
Mol. Mass.94.1145
SMILESC=Cn1ccnc1