Reaction Details
TargetCytochrome P450 3A4
LigandBDBM50295560
Substrate/Competitorn/a
Meas. Tech.n/a
IC50>10000±n/a nM
Citation Bareja, SPJones, SDOblong, JEMills, KJBierman, JC Cosmetic compositions containing substituted azole and methods for improving the appearance of aging skin US Patent US9138393 Publication Date 9/22/2015
 
Cytochrome P450 3A4
Name:Cytochrome P450 3A4
Type:Enzyme
Mol. Mass.:57349.57
Organism:Homo sapiens (Human)
Description:n/a
Residue:503
BDBM50295560
NameBDBM50295560
Synonyms:2-METHYLIMIDAZOLE CHEMBL293391 US9144538, 2-Methylimidazole
TypeSmall organic molecule
Emp. Form.C4H6N2
Mol. Mass.82.1038
SMILESCc1ncc[nH]1