Reaction Details
TargetCytochrome P450 3A4
LigandBDBM181134
Substrate/Competitorn/a
Meas. Tech.n/a
IC50>10000±n/a nM
Citation Bareja, SPJones, SDOblong, JEMills, KJBierman, JC Cosmetic compositions containing substituted azole and methods for improving the appearance of aging skin US Patent US9138393 Publication Date 9/22/2015
 
Cytochrome P450 3A4
Name:Cytochrome P450 3A4
Type:Enzyme
Mol. Mass.:57349.57
Organism:Homo sapiens (Human)
Description:n/a
Residue:503
BDBM181134
NameBDBM181134
Synonyms:US9138393, Glutamylamidoethyl imidazole | US9144538, Glutamylamidoethyl
TypeSmall organic molecule
Emp. Form.C10H16N4O3
Mol. Mass.240.259
SMILESCC(NC(=O)[C@@H](N)CCC(O)=O)c1ncc[nH]1