Reaction Details
TargetSodium channel protein type 10 subunit alpha
LigandBDBM181161
Substrate/Competitorn/a
Meas. Tech.Electrophysiology Assay
IC50 4±n/a nM
Citation Hadida-Ruah, SSAnderson, CArumugam, VAsgian, ILBear, BRTermin, APJohnson, JP Substituted quinoxalines as sodium channel modulators US Patent US9139529 Publication Date 9/22/2015
 
Sodium channel protein type 10 subunit alpha
Name:Sodium channel protein type 10 subunit alpha
Type:Enzyme
Mol. Mass.:219724.17
Organism:Rattus norvegicus (Rat)
Description:Q62968
Residue:1956
BDBM181161
NameBDBM181161
Synonyms:US9139529, 4 | US9783501, Compound 4
TypeSmall organic molecule
Emp. Form.C22H17ClN4O5S
Mol. Mass.484.912
SMILESCOc1ccc(Oc2nc3ccccc3nc2C(=O)Nc2cccc(c2)S(N)(=O)=O)c(Cl)c1